21 Aug 21:46 2014Girar Builder pender robot
*[#127578] DONE srpm=geary-0.7.1-alt1.src.rpm
21 Aug 21:15 2014Girar Builder pender robot
*[#127567] DONE srpm=maven-wagon-1.0-alt10_6jpp7.src.rpm
21 Aug 21:09 2014Girar Builder pender robot
*[#127566] DONE srpm=maven-help-plugin-2.1.1-alt5_8jpp7.src.rpm
21 Aug 21:04 2014Girar Builder pender robot
*[#127565] DONE srpm=maven-eclipse-plugin-2.9-alt5_2jpp7.src.rpm
21 Aug 20:58 2014Girar Builder pender robot
*[#127564] DONE srpm=httpcomponents-core-4.2.2-alt2_1jpp7.src.rpm
21 Aug 20:52 2014Girar Builder pender robot
*[#127563] DONE srpm=httpcomponents-client-4.2.1-alt3_3jpp7.src.rpm
21 Aug 20:46 2014Girar Builder pender robot
*[#127562] DONE srpm=geronimo-jta-1.1.1-alt3_10jpp7.src.rpm
21 Aug 20:41 2014Girar Builder pender robot
*[#127561] DONE srpm=geronimo-jpa-1.1.1-alt3_8jpp7.src.rpm
21 Aug 20:37 2014Girar Builder pender robot
*[#127560] DONE srpm=geronimo-jms-1.1.1-alt3_13jpp7.src.rpm
21 Aug 20:31 2014Girar Builder pender robot
*[#127559] DONE srpm=apache-commons-compress-1.4.1-alt3_2jpp7.src.rpm
21 Aug 19:17 2014Girar Builder pender robot
*[#127533] DONE (try 2) kernel-image-3.15.git=ws-3.15.10-alt4 ...
21 Aug 17:30 2014Girar Builder pender robot
*[#127542] t7 DONE copy=BASE copy=installer-feature-nginx-indexhtml-sta
21 Aug 17:30 2014Girar ACL robot
*[girar-acl] t7 changes summary
21 Aug 17:30 2014Girar ACL robot
*[girar-acl] t7 changes summary
21 Aug 17:30 2014Girar ACL robot
*[girar-acl] t7 changes summary
21 Aug 17:30 2014Girar ACL robot
*[girar-acl] t7 changes summary
21 Aug 17:03 2014Girar Builder awaiter robot
*[#127150] FAILED (try 2) srpm=libint-1.1.6-alt1_2.src.rpm
21 Aug 17:01 2014Girar Builder awaiter robot
*[#127533] FAILED kernel-image-3.15.git=ws-3.15.10-alt4 ...
21 Aug 16:20 2014Girar Builder pender robot
*[#127558] DONE ansible.git=1.7.1-alt1
21 Aug 16:14 2014Girar Builder awaiter robot
*[#127553] FAILED (try 5) kernel-image.git=kernel-image-un-def-3.16.1-a
21 Aug 15:56 2014Girar Builder awaiter robot
*[#127556] TESTED openstack-keystone.git=2014.1.2.1-alt2
21 Aug 15:16 2014Girar Builder pender robot
*[#127555] DONE del=docs-cmc_communication_stand del=docs-dhcp ...
21 Aug 15:15 2014Girar ACL robot
*[girar-acl] sisyphus changes summary
21 Aug 15:02 2014Girar Builder pender robot
*[#127501] p7 DONE (try 2) dnsmasq.git=2.71-alt0.M70P.1
21 Aug 14:59 2014Girar Builder awaiter robot
*[#127553] FAILED (try 4) kernel-image.git=kernel-image-un-def-3.16.1-a
21 Aug 14:52 2014Girar Builder awaiter robot
*[#127553] FAILED (try 3) kernel-image.git=kernel-image-un-def-3.16.1-a
21 Aug 14:47 2014Girar Builder awaiter robot
*[#127553] FAILED (try 2) kernel-image.git=kernel-image-un-def-3.16.1-a
21 Aug 14:41 2014Girar Builder pender robot
*[#127554] DONE cinnamon-control-center.git=2.2.10-alt1 cinnamon.git=2.
21 Aug 14:13 2014Girar Builder awaiter robot
*[#127553] FAILED kernel-image.git=kernel-image-un-def-3.16.1-alt1 ...
21 Aug 14:12 2014Girar ACL robot
*[girar-acl] sisyphus changes summary
21 Aug 13:40 2014Girar Builder pender robot
*[#127552] DONE mediawiki.git=1.23.2-alt1
21 Aug 13:28 2014Girar Builder awaiter robot
*[#127549] FAILED (try 4) kernel-image.git=kernel-image-un-def-3.16.1-a
21 Aug 13:22 2014Girar Builder pender robot
*[#127551] DONE ruby-kde4.git=4.14.0-alt1
21 Aug 13:22 2014Girar ACL robot
*[girar-acl] sisyphus changes summary
21 Aug 13:12 2014Girar Builder awaiter robot
*[#127549] FAILED (try 3) kernel-image.git=kernel-image-un-def-3.16.1-a
21 Aug 13:06 2014Girar Builder awaiter robot
*[#127549] FAILED (try 2) kernel-image.git=kernel-image-un-def-3.16.1-a
21 Aug 13:01 2014Girar Builder pender robot
*[#127550] DONE python-module-cryptography.git=0.5.4-alt1
21 Aug 12:48 2014Girar Builder awaiter robot
*[#127549] FAILED kernel-image.git=kernel-image-un-def-3.16.1-alt1 ...
21 Aug 12:40 2014Girar Builder pender robot
*[#127546] t7 DONE ceph.git=0.80.5-alt0.M70T.1
21 Aug 11:44 2014Girar Builder pender robot
*[#127548] DONE srpm=quiterss-0.16.2-alt1.src.rpm
21 Aug 11:33 2014Girar ACL robot
*[girar-acl] sisyphus changes summary
21 Aug 10:52 2014Girar Builder pender robot
*[#127547] DONE python-module-libacl.git=0.5.2-alt1
21 Aug 10:34 2014Girar Builder awaiter robot
*[#127180] EPERM (try 3) sysvinit.git=2.88-alt4.1 kinit-utils.git=1.5.2
21 Aug 10:20 2014Girar Builder pender robot
*[#127545] DONE python-module-lcms.git=1.19-alt1
21 Aug 09:54 2014Girar Builder pender robot
*[#127544] DONE nvidia_glx_src_340.24.git=340.24-alt132
21 Aug 09:05 2014Girar Builder pender robot
*[#127543] DONE python-module-kaa-metadata.git=0.7.8-alt1.git20130624
21 Aug 08:05 2014Girar Builder pender robot
*[#127541] DONE python-module-kaa-base.git=0.99.2-alt1.git20130522
21 Aug 05:54 2014Girar Builder pender robot
*[#127540] DONE python-module-httplib2.git=0.9-alt1
21 Aug 05:07 2014Girar Builder pender robot
*[#127539] DONE python-module-htmlgen.git=0.4-alt1.git20140517
21 Aug 05:07 2014Girar ACL robot
*[girar-acl] sisyphus changes summary
21 Aug 05:02 2014Girar ACL robot
*[girar-acl] sisyphus changes summary
21 Aug 05:02 2014Girar Builder pender robot
*[#127538] DONE python-module-asserts.git=0.6-alt1.git20140221
21 Aug 04:25 2014Girar Builder pender robot
*[#127537] DONE python-module-html5lib.git=0.999-alt1
21 Aug 04:16 2014Girar Builder pender robot
*[#127536] DONE python-module-gdata.git=2.0.18-alt1.hg20140113
21 Aug 04:16 2014Girar Builder awaiter robot
*[#127535] t7 FAILED srpm=octave-signal-1.3.0-alt0.M70T.1.src.rpm
21 Aug 03:19 2014Girar Builder pender robot
*[#127534] DONE python-module-ftputil.git=3.1-alt1
21 Aug 03:15 2014Girar Builder pender robot
*[#127531] DONE (try 2) slepc.git=real-3.5.0-alt1.git20140729 ...
21 Aug 02:32 2014Girar Builder awaiter robot
*[#127531] FAILED slepc.git=real-3.5.0-alt1.git20140729 ...
21 Aug 02:14 2014Girar Builder awaiter robot
*[#127530] t6 FAILED srpm=octave-nurbs-1.3.7-alt0.M60T.1.src.rpm
21 Aug 02:13 2014Girar Builder awaiter robot
*[#127529] t6 FAILED srpm=octave-nan-2.5.9-alt0.M60T.1.src.rpm
21 Aug 02:13 2014Girar Builder awaiter robot
*[#127528] t6 FAILED srpm=octave-level-set-0.1.0-alt0.M60T.1.src.rpm
21 Aug 02:11 2014Girar Builder awaiter robot
*[#127527] t7 FAILED srpm=octave-nurbs-1.3.7-alt0.M70T.1.src.rpm
21 Aug 02:10 2014Girar Builder awaiter robot
*[#127526] t7 FAILED srpm=octave-nan-2.5.9-alt0.M70T.1.src.rpm
21 Aug 02:00 2014Girar Builder awaiter robot
*[#127155] FAILED (try 2) srpm=cross-gcc-4.9.0-alt1_4.src.rpm
21 Aug 00:14 2014Girar Builder awaiter robot
*[#127525] t7 FAILED srpm=octave-io-2.2.2-alt0.M70T.1.src.rpm
21 Aug 00:13 2014Girar Builder awaiter robot
*[#127524] t7 FAILED srpm=octave-image-2.2.1-alt0.M70T.1.src.rpm
21 Aug 00:11 2014Girar Builder awaiter robot
*[#127523] t7 FAILED srpm=octave-general-1.3.4-alt0.M70T.1.src.rpm
21 Aug 00:10 2014Girar Builder awaiter robot
*[#127522] t7 FAILED srpm=octave-fits-1.0.5-alt1.M70T.1.src.rpm
20 Aug 20:39 2014Girar Builder pender robot
*[#127520] DONE (try 2) srpm=plexus-compiler-2.2-alt1_0jpp7.src.rpm ...
20 Aug 20:29 2014Girar Builder pender robot
*[#127521] DONE srpm=maven-invoker-2.1.1-alt2_0jpp7.src.rpm
20 Aug 20:00 2014Girar Builder awaiter robot
*[#127520] FAILED srpm=plexus-compiler-2.2-alt1_0jpp7.src.rpm ...
20 Aug 19:45 2014Girar Builder pender robot
*[#127519] DONE srpm=xmvn-0.5.0-alt0.1jpp.src.rpm
20 Aug 19:32 2014Girar Builder awaiter robot
*[#127502] FAILED slepc.git=real-3.5.0-alt1.git20140729 ...
20 Aug 19:31 2014Girar Builder awaiter robot
*[#127513] TESTED (try 4) srpm=xmvn-0.5.0-alt0.1jpp.src.rpm
20 Aug 19:27 2014Girar Builder pender robot
*[#127518] DONE srpm=plexus-containers-1.5.5-alt8_6jpp7.src.rpm
20 Aug 19:22 2014Girar Builder pender robot
*[#127500] DONE petsc4py.git=real-3.5-alt1.git20140818 ...
20 Aug 19:09 2014Girar Builder pender robot
*[#127517] DONE srpm=slf4j-1.7.2-alt4_4jpp7.src.rpm
20 Aug 18:57 2014Girar Builder pender robot
*[#127496] DONE (try 2) petsc.git=real-3.5.1-alt1 petsc.git=complex-3.5
20 Aug 18:46 2014Girar Builder awaiter robot
*[#127513] FAILED (try 3) srpm=xmvn-0.5.0-alt0.1jpp.src.rpm
20 Aug 18:44 2014Girar Builder pender robot
*[#127515] DONE srpm=plexus-containers-1.5.5-alt7_6jpp7.src.rpm
20 Aug 18:39 2014Girar Builder pender robot
*[#127516] DONE srpm=maven-invoker-2.1.1-alt1_6jpp7.src.rpm
20 Aug 18:39 2014Girar ACL robot
*[girar-acl] sisyphus changes summary
20 Aug 18:34 2014Girar Builder pender robot
*[#127510] DONE ruby-qt4.git=4.14.0-alt1
20 Aug 18:34 2014Girar ACL robot
*[girar-acl] sisyphus changes summary
20 Aug 18:26 2014Girar Builder pender robot
*[#127514] DONE srpm=slf4j-1.7.2-alt3_4jpp7.src.rpm
20 Aug 18:17 2014Girar Builder pender robot
*[#127505] DONE kde4-smoke.git=4.11.1-alt3
20 Aug 17:58 2014Girar Builder awaiter robot
*[#127513] FAILED srpm=xmvn-0.5.0-alt0.1jpp.src.rpm
20 Aug 17:56 2014Girar Builder pender robot
*[#127512] DONE srpm=aether-1.13.1-alt6_4jpp7.src.rpm
20 Aug 17:32 2014Girar Builder pender robot
*[#127511] DONE srpm=aether-1.13.1-alt5_4jpp7.src.rpm
20 Aug 17:23 2014Girar Builder pender robot
*[#127507] DONE srpm=maven-shared-incremental-1.0-alt0.1jpp.src.rpm
20 Aug 17:22 2014Girar ACL robot
*[girar-acl] sisyphus changes summary
20 Aug 17:20 2014Girar Builder pender robot
*[#127508] DONE srpm=maven-shared-utils-0.3-alt0.1jpp.src.rpm
20 Aug 17:19 2014Girar ACL robot
*[girar-acl] sisyphus changes summary
20 Aug 17:16 2014Girar Builder pender robot
*[#127504] DONE smokeqt.git=4.14.0-alt2
20 Aug 17:02 2014Girar Builder awaiter robot
*[#127496] FAILED petsc.git=real-3.5.1-alt1 petsc.git=complex-3.5.1-alt
20 Aug 16:42 2014Girar Builder pender robot
*[#127212] DONE (try 2) docker-io.git=1.1.2-alt1
20 Aug 16:35 2014Girar Builder pender robot
*[#127495] DONE dakota.git=6.0-alt1
20 Aug 16:22 2014Girar Builder pender robot
*[#127503] DONE libqwt.git=5.2.3-alt1
20 Aug 16:06 2014Girar Builder pender robot
*[#127499] p7 DONE copy=installer-distro-chainmail copy=alterator-distr
20 Aug 16:01 2014Girar Builder pender robot
*[#127497] DONE (try 2) installer-distro-chainmail.git=2.97.0-alt1